Ocena wątku:
  • 0 głosów - średnia: 0
  • 1
  • 2
  • 3
  • 4
  • 5

Problem z kompilacją TFS 1.3 v2
#1

Po wpisaniu komendy make wykrzaczył sie błąd:


Cytat:root@instance-2:/home/ots/build# make
[  1%] Generating CXX prefix source cotire/tfs_CXX_prefix.cxx
[  2%] Generating CXX prefix header cotire/tfs_CXX_prefix.hxx
[  3%] Building CXX precompiled header cotire/tfs_CXX_prefix.hxx.gch
In file included from /home/ots/build/cotire/tfs_CXX_prefix.cxx:4:0,
                from /home/ots/build/cotire/tfs_CXX_prefix.hxx:4:
/home/ots/src/otpch.h:54:27: fatal error: spdlog/spdlog.h: No such file or directory
compilation terminated.
CMake Error at cmake/FindCotire.cmake:1783 (message):
  cotire: error 1 precompiling /home/ots/build/cotire/tfs_CXX_prefix.hxx.
Call Stack (most recent call first):
  cmake/FindCotire.cmake:3332 (cotire_precompile_prefix_header)



CMakeFiles/tfs.dir/build.make:62: recipe for target 'cotire/tfs_CXX_prefix.hxx.gch' failed
make[2]: *** [cotire/tfs_CXX_prefix.hxx.gch] Error 1
CMakeFiles/Makefile2:67: recipe for target 'CMakeFiles/tfs.dir/all' failed
make[1]: *** [CMakeFiles/tfs.dir/all] Error 2
Makefile:83: recipe for target 'all' failed
make: *** [all] Error 2


rozwiązaniem jest wpisanie komendy: 
Kod:
apt-get install libspdlog-dev
Odpowiedz


Skocz do:


Użytkownicy przeglądający ten wątek: 1 gości